Target
Tyrosine-protein phosphatase non-receptor type 7
Ligand
BDBM35494
Substrate
Meas. Tech.
HTS Discovery of Chemical Inhibitors of HePTP, a Leukemia Target
IC50
11270±n/a nM
Citation
 PubChem, PC HTS Discovery of Chemical Inhibitors of HePTP, a Leukemia Target PubChem Bioassay (2008)[AID] 
Target
Name:
Tyrosine-protein phosphatase non-receptor type 7
Synonyms:
He-PTP Hematopoietic protein-tyrosine phosphatase (HEPTP) PTPN7 Tyrosine-protein phosphatase non-receptor type 7 | Tyrosine-protein phosphatase non-receptor type 7 (HEPTP)
Type:
Protein
Mol. Mass.:
40530.79
Organism:
Homo sapiens (Human)
Description:
P35236
Residue:
360
  
Inhibitor
Name:
BDBM35494
Synonyms:
(4-methoxyphenyl)-(5-oxido-4-p-anisoyl-furazan-5-ium-3-yl)methanone (4-methoxyphenyl)-[4-[(4-methoxyphenyl)-oxomethyl]-5-oxido-1,2,5-oxadiazol-5-ium-3-yl]methanone SMR000038404 cid_286532
Type:
Small organic molecule
Emp. Form.:
C18H14N2O6
Mol. Mass.:
354.3136
SMILES:
COc1ccc(cc1)C(=O)c1n[o+]n([O-])c1C(=O)c1ccc(OC)cc1
: