Target
Tyrosine-protein phosphatase non-receptor type 7
Ligand
BDBM53521
Substrate
Meas. Tech.
HTS Discovery of Chemical Inhibitors of HePTP, a Leukemia Target
IC50
100000±n/a nM
Citation
 PubChem, PC HTS Discovery of Chemical Inhibitors of HePTP, a Leukemia Target PubChem Bioassay (2008)[AID] 
Target
Name:
Tyrosine-protein phosphatase non-receptor type 7
Synonyms:
He-PTP Hematopoietic protein-tyrosine phosphatase (HEPTP) PTPN7 Tyrosine-protein phosphatase non-receptor type 7 | Tyrosine-protein phosphatase non-receptor type 7 (HEPTP)
Type:
Protein
Mol. Mass.:
40530.79
Organism:
Homo sapiens (Human)
Description:
P35236
Residue:
360
  
Inhibitor
Name:
BDBM53521
Synonyms:
MLS000037717 N-[3-cyano-1-(4-methylphenyl)pyrrolo[3,2-b]quinoxalin-2-yl]propanamide SMR000041837 | cid_661221
Type:
Small organic molecule
Emp. Form.:
C21H17N5O
Mol. Mass.:
355.3926
SMILES:
CCC(=O)Nc1c(C#N)c2nc3ccccc3nc2n1-c1ccc(C)cc1
: