Target
Tyrosine-protein phosphatase non-receptor type 7
Ligand
BDBM35379
Substrate
Meas. Tech.
HTS Discovery of Chemical Inhibitors of HePTP, a Leukemia Target
IC50
5270±n/a nM
Citation
 PubChem, PC HTS Discovery of Chemical Inhibitors of HePTP, a Leukemia Target PubChem Bioassay (2008)[AID] 
Target
Name:
Tyrosine-protein phosphatase non-receptor type 7
Synonyms:
He-PTP Hematopoietic protein-tyrosine phosphatase (HEPTP) PTPN7 Tyrosine-protein phosphatase non-receptor type 7 | Tyrosine-protein phosphatase non-receptor type 7 (HEPTP)
Type:
Protein
Mol. Mass.:
40530.79
Organism:
Homo sapiens (Human)
Description:
P35236
Residue:
360
  
Inhibitor
Name:
BDBM35379
Synonyms:
2-(2-furanyl)-4-quinolinecarboxylic acid [2-[4-amino-1-methyl-3-(2-methylpropyl)-2,6-dioxo-5-pyrimidinyl]-2-oxoethyl] ester MLS000058168 [2-[4-amino-1-methyl-3-(2-methylpropyl)-2,6-dioxopyrimidin-5-yl]-2-oxoethyl] 2-(furan-2-yl)quinoline-4-carboxylate cid_2094474
Type:
Small organic molecule
Emp. Form.:
C25H24N4O6
Mol. Mass.:
476.4813
SMILES:
CC(C)Cn1c(N)c(C(=O)COC(=O)c2cc(nc3ccccc23)-c2ccco2)c(=O)n(C)c1=O
: