Target
Tyrosine-protein phosphatase non-receptor type 7
Ligand
BDBM34185
Substrate
Meas. Tech.
HTS Discovery of Chemical Inhibitors of HePTP, a Leukemia Target
IC50
2120±n/a nM
Citation
 PubChem, PC HTS Discovery of Chemical Inhibitors of HePTP, a Leukemia Target PubChem Bioassay (2008)[AID] 
Target
Name:
Tyrosine-protein phosphatase non-receptor type 7
Synonyms:
He-PTP Hematopoietic protein-tyrosine phosphatase (HEPTP) PTPN7 Tyrosine-protein phosphatase non-receptor type 7 | Tyrosine-protein phosphatase non-receptor type 7 (HEPTP)
Type:
Protein
Mol. Mass.:
40530.79
Organism:
Homo sapiens (Human)
Description:
P35236
Residue:
360
  
Inhibitor
Name:
BDBM34185
Synonyms:
5-(2,4-dichlorophenyl)-N-[2-methyl-5-(3-methyl-[1,2,4]triazolo[3,4-b][1,3,4]thiadiazol-6-yl)phenyl]-2-furamide 5-(2,4-dichlorophenyl)-N-[2-methyl-5-(3-methyl-[1,2,4]triazolo[3,4-b][1,3,4]thiadiazol-6-yl)phenyl]furan-2-carboxamide MLS000050202 cid_2213056
Type:
Small organic molecule
Emp. Form.:
C22H15Cl2N5O2S
Mol. Mass.:
484.358
SMILES:
Cc1nnc2sc(nn12)-c1ccc(C)c(NC(=O)c2ccc(o2)-c2ccc(Cl)cc2Cl)c1
: