Target
Tyrosine-protein phosphatase non-receptor type 7
Ligand
BDBM31764
Substrate
Meas. Tech.
HTS Discovery of Chemical Inhibitors of HePTP, a Leukemia Target
IC50
490±n/a nM
Citation
 PubChem, PC HTS Discovery of Chemical Inhibitors of HePTP, a Leukemia Target PubChem Bioassay (2008)[AID] 
Target
Name:
Tyrosine-protein phosphatase non-receptor type 7
Synonyms:
He-PTP Hematopoietic protein-tyrosine phosphatase (HEPTP) PTPN7 Tyrosine-protein phosphatase non-receptor type 7 | Tyrosine-protein phosphatase non-receptor type 7 (HEPTP)
Type:
Protein
Mol. Mass.:
40530.79
Organism:
Homo sapiens (Human)
Description:
P35236
Residue:
360
  
Inhibitor
Name:
BDBM31764
Synonyms:
MLS-0005454.0001 N-(5-pentyl-1,3,4-thiadiazol-2-yl)-2-thiophen-2-yl-ethanamide cid_2207086
Type:
Small organic molecule
Emp. Form.:
C13H17N3OS2
Mol. Mass.:
295.424
SMILES:
CCCCCc1nnc(NC(=O)Cc2cccs2)s1
: