Target
Tyrosine-protein phosphatase non-receptor type 7
Ligand
BDBM53562
Substrate
Meas. Tech.
HTS Discovery of Chemical Inhibitors of HePTP, a Leukemia Target
IC50
100000±n/a nM
Citation
 PubChem, PC HTS Discovery of Chemical Inhibitors of HePTP, a Leukemia Target PubChem Bioassay (2008)[AID] 
Target
Name:
Tyrosine-protein phosphatase non-receptor type 7
Synonyms:
He-PTP Hematopoietic protein-tyrosine phosphatase (HEPTP) PTPN7 Tyrosine-protein phosphatase non-receptor type 7 | Tyrosine-protein phosphatase non-receptor type 7 (HEPTP)
Type:
Protein
Mol. Mass.:
40530.79
Organism:
Homo sapiens (Human)
Description:
P35236
Residue:
360
  
Inhibitor
Name:
BDBM53562
Synonyms:
(7-chloro-4-quinolinyl)[2-(diethylamino)ethyl]amine MLS000066547 N-(7-chloro-4-quinolinyl)-N',N'-diethylethane-1,2-diamine SMR000080960 | cid_408190
Type:
Small organic molecule
Emp. Form.:
C15H20ClN3
Mol. Mass.:
277.792
SMILES:
CCN(CC)CCNc1ccnc2cc(Cl)ccc12
: