Target
Tyrosine-protein phosphatase non-receptor type 7
Ligand
BDBM53570
Substrate
Meas. Tech.
HTS Discovery of Chemical Inhibitors of HePTP, a Leukemia Target
IC50
100000±n/a nM
Citation
 PubChem, PC HTS Discovery of Chemical Inhibitors of HePTP, a Leukemia Target PubChem Bioassay (2008)[AID] 
Target
Name:
Tyrosine-protein phosphatase non-receptor type 7
Synonyms:
He-PTP Hematopoietic protein-tyrosine phosphatase (HEPTP) PTPN7 Tyrosine-protein phosphatase non-receptor type 7 | Tyrosine-protein phosphatase non-receptor type 7 (HEPTP)
Type:
Protein
Mol. Mass.:
40530.79
Organism:
Homo sapiens (Human)
Description:
P35236
Residue:
360
  
Inhibitor
Name:
BDBM53570
Synonyms:
MLS000116433 N-[[3-(4-bromophenyl)-[1,3]thiazolo[2,3-c][1,2,4]triazol-6-yl]methyl]cyclopentanamine [3-(4-bromophenyl)thiazolo[2,3-c][1,2,4]triazol-6-yl]methyl-cyclopentyl-amine | cid_4167655
Type:
Small organic molecule
Emp. Form.:
C16H17BrN4S
Mol. Mass.:
377.302
SMILES:
Brc1ccc(cc1)-c1nnc2sc(CNC3CCCC3)cn12
: