Target
Heat shock cognate 71 kDa protein
Ligand
BDBM31699
Substrate
Meas. Tech.
High Throughput Screening Assay for Hsc70 Inhibitors
IC50
999000±n/a nM
Citation
 PubChem, PC High Throughput Screening Assay for Hsc70 Inhibitors PubChem Bioassay (2007)[AID] 
Target
Name:
Heat shock cognate 71 kDa protein
Synonyms:
HSC70 HSP7C_HUMAN HSPA8 heat shock 70kDa protein 8 isoform 2
Type:
Enzyme Catalytic Domain
Mol. Mass.:
70887.67
Organism:
Homo sapiens (Human)
Description:
gi_5729877
Residue:
646
  
Inhibitor
Name:
BDBM31699
Synonyms:
(4-methoxy-1,3-benzothiazol-2-yl)-[5-(4-methoxyphenyl)-1,3,4-oxadiazol-2-yl]amine MLS000045458 SMR000027218 | cid_3236395
Type:
Small organic molecule
Emp. Form.:
C17H14N4O3S
Mol. Mass.:
354.383
SMILES:
COc1ccc(cc1)-c1nnc(Nc2nc3c(OC)cccc3s2)o1
: