Target
Heat shock cognate 71 kDa protein
Ligand
BDBM31705
Substrate
Meas. Tech.
High Throughput Screening Assay for Hsc70 Inhibitors
IC50
999000±n/a nM
Citation
 PubChem, PC High Throughput Screening Assay for Hsc70 Inhibitors PubChem Bioassay (2007)[AID] 
Target
Name:
Heat shock cognate 71 kDa protein
Synonyms:
HSC70 HSP7C_HUMAN HSPA8 heat shock 70kDa protein 8 isoform 2
Type:
Enzyme Catalytic Domain
Mol. Mass.:
70887.67
Organism:
Homo sapiens (Human)
Description:
gi_5729877
Residue:
646
  
Inhibitor
Name:
BDBM31705
Synonyms:
3-(1-benzofuran-2-yl)-1-ethoxy-2(1H)-quinoxalinone 4-oxide 3-(1-benzofuran-2-yl)-1-ethoxy-4-oxidoquinoxalin-4-ium-2-one 3-(benzofuran-2-yl)-1-ethoxy-4-oxido-quinoxalin-4-ium-2-one SMR000075322 | cid_951071
Type:
Small organic molecule
Emp. Form.:
C18H14N2O4
Mol. Mass.:
322.3148
SMILES:
CCOn1c2ccccc2[n+]([O-])c(-c2cc3ccccc3o2)c1=O
: