Target
Heat shock cognate 71 kDa protein
Ligand
BDBM31721
Substrate
Meas. Tech.
High Throughput Screening Assay for Hsc70 Inhibitors
IC50
999000±n/a nM
Citation
 PubChem, PC High Throughput Screening Assay for Hsc70 Inhibitors PubChem Bioassay (2007)[AID] 
Target
Name:
Heat shock cognate 71 kDa protein
Synonyms:
HSC70 HSP7C_HUMAN HSPA8 heat shock 70kDa protein 8 isoform 2
Type:
Enzyme Catalytic Domain
Mol. Mass.:
70887.67
Organism:
Homo sapiens (Human)
Description:
gi_5729877
Residue:
646
  
Inhibitor
Name:
BDBM31721
Synonyms:
4-[(E)-2-(2-chloranyl-5-nitro-phenyl)ethenyl]-6-(trifluoromethyl)-1H-pyrimidin-2-one 4-[(E)-2-(2-chloro-5-nitrophenyl)ethenyl]-6-(trifluoromethyl)-1H-pyrimidin-2-one MLS000530560 cid_5347285
Type:
Small organic molecule
Emp. Form.:
C13H7ClF3N3O3
Mol. Mass.:
345.661
SMILES:
[O-][N+](=O)c1ccc(Cl)c(C=Cc2cc(nc(=O)[nH]2)C(F)(F)F)c1
: