Target
Integrin alpha-4
Ligand
BDBM39862
Substrate
Meas. Tech.
Dose-Response of Allosteric Antagonists for the VLA-4 Integrin
EC50
100000±n/a nM
Citation
 PubChem, PC Dose-Response of Allosteric Antagonists for the VLA-4 Integrin PubChem Bioassay (2007)[AID] 
Target
Name:
Integrin alpha-4
Synonyms:
CD49 antigen-like family member D CD49d antigen ITA4_HUMAN Integrin alpha-4 Integrin alpha-IV VLA-4 integrin alpha 4 precursor | integrin alpha-4 precursor
Type:
Membrane Protein
Mol. Mass.:
114897.35
Organism:
Homo sapiens (Human)
Description:
P13612
Residue:
1032
  
Inhibitor
Name:
BDBM39862
Synonyms:
Deprenyl MLS000069378 N-methyl-1-phenyl-N-prop-2-ynyl-propan-2-amine;hydrochloride SMR000058408 cid_92913 | methyl-(1-methyl-2-phenyl-ethyl)-propargyl-amine;hydrochloride
Type:
Small organic molecule
Emp. Form.:
C13H17N
Mol. Mass.:
187.2808
SMILES:
CC(Cc1ccccc1)N(C)CC#C
: