Target
Integrin alpha-4
Ligand
BDBM37678
Substrate
Meas. Tech.
Dose-Response of Allosteric Antagonists for the VLA-4 Integrin
EC50
11360±n/a nM
Citation
 PubChem, PC Dose-Response of Allosteric Antagonists for the VLA-4 Integrin PubChem Bioassay (2007)[AID] 
Target
Name:
Integrin alpha-4
Synonyms:
CD49 antigen-like family member D CD49d antigen ITA4_HUMAN Integrin alpha-4 Integrin alpha-IV VLA-4 integrin alpha 4 precursor | integrin alpha-4 precursor
Type:
Membrane Protein
Mol. Mass.:
114897.35
Organism:
Homo sapiens (Human)
Description:
P13612
Residue:
1032
  
Inhibitor
Name:
BDBM37678
Synonyms:
MLS000057468 N-(5-quinolyl)thiophene-2-sulfonamide SMR000064011 | cid_2082094
Type:
Small organic molecule
Emp. Form.:
C13H10N2O2S2
Mol. Mass.:
290.361
SMILES:
O=S(=O)(Nc1cccc2ncccc12)c1cccs1
: