Target
Integrin alpha-4
Ligand
BDBM39863
Substrate
Meas. Tech.
Dose-Response of Allosteric Antagonists for the VLA-4 Integrin
EC50
20190±n/a nM
Citation
 PubChem, PC Dose-Response of Allosteric Antagonists for the VLA-4 Integrin PubChem Bioassay (2007)[AID] 
Target
Name:
Integrin alpha-4
Synonyms:
CD49 antigen-like family member D CD49d antigen ITA4_HUMAN Integrin alpha-4 Integrin alpha-IV VLA-4 integrin alpha 4 precursor | integrin alpha-4 precursor
Type:
Membrane Protein
Mol. Mass.:
114897.35
Organism:
Homo sapiens (Human)
Description:
P13612
Residue:
1032
  
Inhibitor
Name:
BDBM39863
Synonyms:
2-[[4-cyano-3-[2-[(4-methyl-1,3-thiazol-2-yl)amino]-2-oxidanylidene-ethyl]sulfanyl-1,2-thiazol-5-yl]sulfanyl]-N-(4-methyl-1,3-thiazol-2-yl)ethanamide 2-[[4-cyano-3-[[2-[(4-methyl-2-thiazolyl)amino]-2-oxoethyl]thio]-5-isothiazolyl]thio]-N-(4-methyl-2-thiazolyl)acetamide MLS000069333 cid_658035
Type:
Small organic molecule
Emp. Form.:
C16H14N6O2S5
Mol. Mass.:
482.646
SMILES:
Cc1csc(NC(=O)CSc2nsc(SCC(=O)Nc3nc(C)cs3)c2C#N)n1
: