Target
Mannose-6-phosphate isomerase
Ligand
BDBM34590
Substrate
Meas. Tech.
HTS identification of compounds inhibiting phosphomannose isomerase (PMI) via a fluorescence intensity assay.
IC50
31993±n/a nM
Citation
 PubChem, PC HTS identification of compounds inhibiting phosphomannose isomerase (PMI) via a fluorescence intensity assay. PubChem Bioassay (2009)[AID] 
Target
Name:
Mannose-6-phosphate isomerase
Synonyms:
MPI MPI_HUMAN PMI1
Type:
PROTEIN
Mol. Mass.:
46651.35
Organism:
Homo sapiens (Human)
Description:
ChEMBL_1448919
Residue:
423
  
Inhibitor
Name:
BDBM34590
Synonyms:
1-ethyl-2-benzo[cd]indolone MLS000055006 cid_74592
Type:
Small organic molecule
Emp. Form.:
C13H11NO
Mol. Mass.:
197.2325
SMILES:
CCN1C(=O)c2cccc3cccc1c23
: