Target
Mannose-6-phosphate isomerase
Ligand
BDBM34737
Substrate
Meas. Tech.
HTS identification of compounds inhibiting phosphomannose isomerase (PMI) via a fluorescence intensity assay.
IC50
6777.3±n/a nM
Citation
 PubChem, PC HTS identification of compounds inhibiting phosphomannose isomerase (PMI) via a fluorescence intensity assay. PubChem Bioassay (2009)[AID] 
Target
Name:
Mannose-6-phosphate isomerase
Synonyms:
MPI MPI_HUMAN PMI1
Type:
PROTEIN
Mol. Mass.:
46651.35
Organism:
Homo sapiens (Human)
Description:
ChEMBL_1448919
Residue:
423
  
Inhibitor
Name:
BDBM34737
Synonyms:
2-(4-methylphenyl)-1,2-benzisothiazol-3(2H)-one 2-(p-tolyl)-1,2-benzothiazol-3-one SMR000200989 cid_935415
Type:
Small organic molecule
Emp. Form.:
C14H11NOS
Mol. Mass.:
241.308
SMILES:
Cc1ccc(cc1)-n1sc2ccccc2c1=O
: