Target
Mannose-6-phosphate isomerase
Ligand
BDBM53612
Substrate
Meas. Tech.
HTS identification of compounds inhibiting phosphomannose isomerase (PMI) via a fluorescence intensity assay.
IC50
50000±n/a nM
Citation
 PubChem, PC HTS identification of compounds inhibiting phosphomannose isomerase (PMI) via a fluorescence intensity assay. PubChem Bioassay (2009)[AID] 
Target
Name:
Mannose-6-phosphate isomerase
Synonyms:
MPI MPI_HUMAN PMI1
Type:
PROTEIN
Mol. Mass.:
46651.35
Organism:
Homo sapiens (Human)
Description:
ChEMBL_1448919
Residue:
423
  
Inhibitor
Name:
BDBM53612
Synonyms:
1,1,2,3-tetramethyl-1H-benzo[e]indolium 1,1,2,3-tetramethylbenzo[e]indol-3-ium SMR000203358 | cid_2783649
Type:
Small organic molecule
Emp. Form.:
C16H18N
Mol. Mass.:
224.3203
SMILES:
CC1=[N+](C)c2ccc3ccccc3c2C1(C)C
: