Target
Mannose-6-phosphate isomerase
Ligand
BDBM34879
Substrate
Meas. Tech.
HTS identification of compounds inhibiting phosphomannose isomerase (PMI) via a fluorescence intensity assay.
IC50
3927.9±n/a nM
Citation
 PubChem, PC HTS identification of compounds inhibiting phosphomannose isomerase (PMI) via a fluorescence intensity assay. PubChem Bioassay (2009)[AID] 
Target
Name:
Mannose-6-phosphate isomerase
Synonyms:
MPI MPI_HUMAN PMI1
Type:
PROTEIN
Mol. Mass.:
46651.35
Organism:
Homo sapiens (Human)
Description:
ChEMBL_1448919
Residue:
423
  
Inhibitor
Name:
BDBM34879
Synonyms:
(3-chloro-4-ethoxy-5-methoxy-benzyl)-(4-pyrrolidinophenyl)amine MLS000672337 N-[(3-chloro-4-ethoxy-5-methoxyphenyl)methyl]-4-(1-pyrrolidinyl)aniline SMR000295755 | cid_979661
Type:
Small organic molecule
Emp. Form.:
C20H25ClN2O2
Mol. Mass.:
360.878
SMILES:
CCOc1c(Cl)cc(CNc2ccc(cc2)N2CCCC2)cc1OC
: