Target
Mannose-6-phosphate isomerase
Ligand
BDBM53631
Substrate
Meas. Tech.
HTS identification of compounds inhibiting phosphomannose isomerase (PMI) via a fluorescence intensity assay.
IC50
50000±n/a nM
Citation
 PubChem, PC HTS identification of compounds inhibiting phosphomannose isomerase (PMI) via a fluorescence intensity assay. PubChem Bioassay (2009)[AID] 
Target
Name:
Mannose-6-phosphate isomerase
Synonyms:
MPI MPI_HUMAN PMI1
Type:
PROTEIN
Mol. Mass.:
46651.35
Organism:
Homo sapiens (Human)
Description:
ChEMBL_1448919
Residue:
423
  
Inhibitor
Name:
BDBM53631
Synonyms:
1-(3,5-dimethylphenyl)-3-(1H-1,2,4-triazol-5-ylsulfanyl)pyrrolidine-2,5-dione 1-(3,5-dimethylphenyl)-3-(1H-1,2,4-triazol-5-ylthio)pyrrolidine-2,5-quinone SMR000285243 | cid_2886035
Type:
Small organic molecule
Emp. Form.:
C14H14N4O2S
Mol. Mass.:
302.352
SMILES:
Cc1cc(C)cc(c1)-n1c(O)cc(Sc2nnc[nH]2)c1O
: