Target
Mannose-6-phosphate isomerase
Ligand
BDBM46597
Substrate
Meas. Tech.
HTS identification of compounds inhibiting phosphomannose isomerase (PMI) via a fluorescence intensity assay.
IC50
11181±n/a nM
Citation
 PubChem, PC HTS identification of compounds inhibiting phosphomannose isomerase (PMI) via a fluorescence intensity assay. PubChem Bioassay (2009)[AID] 
Target
Name:
Mannose-6-phosphate isomerase
Synonyms:
MPI MPI_HUMAN PMI1
Type:
PROTEIN
Mol. Mass.:
46651.35
Organism:
Homo sapiens (Human)
Description:
ChEMBL_1448919
Residue:
423
  
Inhibitor
Name:
BDBM46597
Synonyms:
(2,4-dimethylphenyl)-(6-methyl-2,5-dihydropyrazolo[1,5-b][1,2,4]thiadiazol-2-yl)amine N-(2,4-dimethylphenyl)-6-methyl-2,5-dihydropyrazolo[1,5-b][1,2,4]thiadiazol-2-amine | cid_5293705
Type:
Small organic molecule
Emp. Form.:
C13H16N4S
Mol. Mass.:
260.358
SMILES:
Cc1cc2NC(Nc3ccc(C)cc3C)Sn2n1
: