Target
Mannose-6-phosphate isomerase
Ligand
BDBM34923
Substrate
Meas. Tech.
HTS identification of compounds inhibiting phosphomannose isomerase (PMI) via a fluorescence intensity assay.
IC50
50000±n/a nM
Citation
 PubChem, PC HTS identification of compounds inhibiting phosphomannose isomerase (PMI) via a fluorescence intensity assay. PubChem Bioassay (2009)[AID] 
Target
Name:
Mannose-6-phosphate isomerase
Synonyms:
MPI MPI_HUMAN PMI1
Type:
PROTEIN
Mol. Mass.:
46651.35
Organism:
Homo sapiens (Human)
Description:
ChEMBL_1448919
Residue:
423
  
Inhibitor
Name:
BDBM34923
Synonyms:
3-(3,5-dimethyl-1-pyrazolyl)-6-[4-(4-fluorophenyl)-1-piperazinyl]-1,2,4,5-tetrazine 3-(3,5-dimethylpyrazol-1-yl)-6-[4-(4-fluorophenyl)piperazin-1-yl]-1,2,4,5-tetrazine MLS000695219 cid_3811783
Type:
Small organic molecule
Emp. Form.:
C17H19FN8
Mol. Mass.:
354.3848
SMILES:
Cc1cc(C)n(n1)-c1nnc(nn1)N1CCN(CC1)c1ccc(F)cc1
: