Target
Mannose-6-phosphate isomerase
Ligand
BDBM33187
Substrate
Meas. Tech.
HTS identification of compounds inhibiting phosphomannose isomerase (PMI) via a fluorescence intensity assay.
IC50
26728±n/a nM
Citation
 PubChem, PC HTS identification of compounds inhibiting phosphomannose isomerase (PMI) via a fluorescence intensity assay. PubChem Bioassay (2009)[AID] 
Target
Name:
Mannose-6-phosphate isomerase
Synonyms:
MPI MPI_HUMAN PMI1
Type:
PROTEIN
Mol. Mass.:
46651.35
Organism:
Homo sapiens (Human)
Description:
ChEMBL_1448919
Residue:
423
  
Inhibitor
Name:
BDBM33187
Synonyms:
3-[(4-chloranyl-1,2,3-dithiazol-5-ylidene)amino]benzenecarbonitrile 3-[(4-chloro-5H-1,2,3-dithiazol-5-yliden)amino]benzenecarbonitrile MLS000691990 cid_1471639
Type:
Small organic molecule
Emp. Form.:
C9H4ClN3S2
Mol. Mass.:
253.731
SMILES:
Clc1nss\c1=N\c1cccc(c1)C#N
: