Target
Mannose-6-phosphate isomerase
Ligand
BDBM53637
Substrate
Meas. Tech.
HTS identification of compounds inhibiting phosphomannose isomerase (PMI) via a fluorescence intensity assay.
IC50
50000±n/a nM
Citation
 PubChem, PC HTS identification of compounds inhibiting phosphomannose isomerase (PMI) via a fluorescence intensity assay. PubChem Bioassay (2009)[AID] 
Target
Name:
Mannose-6-phosphate isomerase
Synonyms:
MPI MPI_HUMAN PMI1
Type:
PROTEIN
Mol. Mass.:
46651.35
Organism:
Homo sapiens (Human)
Description:
ChEMBL_1448919
Residue:
423
  
Inhibitor
Name:
BDBM53637
Synonyms:
3-[(2E)-2-(pyridin-3-ylmethylene)hydrazino]benzoic acid 3-[2-(pyridin-3-ylmethylidene)hydrazinyl]benzoic acid MLS000673315 cid_4438636
Type:
Small organic molecule
Emp. Form.:
C13H11N3O2
Mol. Mass.:
241.2453
SMILES:
OC(=O)c1cccc(c1)N=NCc1cccnc1
: