Target
M1 family aminopeptidase
Ligand
BDBM53721
Substrate
Meas. Tech.
Inhibitors of Plasmodium falciparum M1- Family Alanyl Aminopeptidase (M1AAP)
IC50
2600±n/a nM
Citation
 PubChem, PC Inhibitors of Plasmodium falciparum M1- Family Alanyl Aminopeptidase (M1AAP) PubChem Bioassay (2008)[AID] 
Target
Name:
M1 family aminopeptidase
Synonyms:
AMPN_PLAF7 Zinc aminopeptidase | m1-family aminopeptidase
Type:
PROTEIN
Mol. Mass.:
126072.31
Organism:
Plasmodium falciparum (isolate FcB1 / Columbia)
Description:
ChEMBL_735637
Residue:
1085
  
Inhibitor
Name:
BDBM53721
Synonyms:
(4R)-4-[(3R,5S,7S,8R,9S,10S,13R,14S,17R)-10,13-dimethyl-3,7-bis(oxidanyl)-2,3,4,5,6,7,8,9,11,12,14,15,16,17-tetradecahydro-1H-cyclopenta[a]phenanthren-17-yl]pentanoic acid (4R)-4-[(3R,5S,7S,8R,9S,10S,13R,14S,17R)-3,7-dihydroxy-10,13-dimethyl-2,3,4,5,6,7,8,9,11,12,14,15,16,17-tetradecahydro-1H-cyclopenta[a]phenanthren-17-yl]valeric acid 3alpha,7beta-dihydroxycholanic acid CHEMBL1551 SMR000058403 URSODEOXYCHOLIC ACID Urso 250 Ursodesoxycholic Acid ursodeoxycholicacid
Type:
Small organic molecule
Emp. Form.:
C24H40O4
Mol. Mass.:
392.572
SMILES:
C[C@H](CCC(O)=O)[C@H]1CC[C@H]2[C@@H]3[C@@H](O)C[C@@H]4C[C@H](O)CC[C@]4(C)[C@H]3CC[C@]12C
: