Target
M1 family aminopeptidase
Ligand
BDBM50252
Substrate
Meas. Tech.
Inhibitors of Plasmodium falciparum M1- Family Alanyl Aminopeptidase (M1AAP)
IC50
5150±n/a nM
Citation
 PubChem, PC Inhibitors of Plasmodium falciparum M1- Family Alanyl Aminopeptidase (M1AAP) PubChem Bioassay (2008)[AID] 
Target
Name:
M1 family aminopeptidase
Synonyms:
AMPN_PLAF7 Zinc aminopeptidase | m1-family aminopeptidase
Type:
PROTEIN
Mol. Mass.:
126072.31
Organism:
Plasmodium falciparum (isolate FcB1 / Columbia)
Description:
ChEMBL_735637
Residue:
1085
  
Inhibitor
Name:
BDBM50252
Synonyms:
(6Z)-5-azanylidene-6-[[1-(4-chlorophenyl)pyrrol-2-yl]methylidene]-3-methylsulfonyl-[1,2,4]thiadiazolo[4,5-a]pyrimidin-7-one (6Z)-6-[[1-(4-chlorophenyl)pyrrol-2-yl]methylene]-5-imino-3-mesyl-[1,2,4]thiadiazolo[4,5-a]pyrimidin-7-one (6Z)-6-{[1-(4-chlorophenyl)-1H-pyrrol-2-yl]methylene}-5-imino-3-(methylsulfonyl)-5,6-dihydro-7H-[1,2,4]thiadiazolo[4,5-a]pyrimidin-7-one SMR000206347 | cid_12005346
Type:
Small organic molecule
Emp. Form.:
C17H12ClN5O3S2
Mol. Mass.:
433.892
SMILES:
CS(=O)(=O)C1=NSC2=NC(=O)\C(=C/c3cccn3-c3ccc(Cl)cc3)C(=N)N12
: