Target
M1 family aminopeptidase
Ligand
BDBM53906
Substrate
Meas. Tech.
Inhibitors of Plasmodium falciparum M1- Family Alanyl Aminopeptidase (M1AAP)
IC50
4600±n/a nM
Citation
 PubChem, PC Inhibitors of Plasmodium falciparum M1- Family Alanyl Aminopeptidase (M1AAP) PubChem Bioassay (2008)[AID] 
Target
Name:
M1 family aminopeptidase
Synonyms:
AMPN_PLAF7 Zinc aminopeptidase | m1-family aminopeptidase
Type:
PROTEIN
Mol. Mass.:
126072.31
Organism:
Plasmodium falciparum (isolate FcB1 / Columbia)
Description:
ChEMBL_735637
Residue:
1085
  
Inhibitor
Name:
BDBM53906
Synonyms:
4-[(3E)-3-(6-chloranyl-2-oxidanylidene-4-phenyl-quinolin-3-ylidene)-5-phenyl-pyrazolidin-1-yl]-4-oxidanylidene-butanoic acid 4-[(3E)-3-(6-chloro-2-oxo-4-phenyl-3-quinolinylidene)-5-phenyl-1-pyrazolidinyl]-4-oxobutanoic acid CHEMBL1332173 SMR000273564 | cid_5344006
Type:
Small organic molecule
Emp. Form.:
C28H22ClN3O4
Mol. Mass.:
499.945
SMILES:
OC(=O)CCC(=O)N1N=C(CC1c1ccccc1)c1c(-c2ccccc2)c2cc(Cl)ccc2[nH]c1=O
: