Target
M1 family aminopeptidase
Ligand
BDBM53958
Substrate
Meas. Tech.
Inhibitors of Plasmodium falciparum M1- Family Alanyl Aminopeptidase (M1AAP)
IC50
2570±n/a nM
Citation
 PubChem, PC Inhibitors of Plasmodium falciparum M1- Family Alanyl Aminopeptidase (M1AAP) PubChem Bioassay (2008)[AID] 
Target
Name:
M1 family aminopeptidase
Synonyms:
AMPN_PLAF7 Zinc aminopeptidase | m1-family aminopeptidase
Type:
PROTEIN
Mol. Mass.:
126072.31
Organism:
Plasmodium falciparum (isolate FcB1 / Columbia)
Description:
ChEMBL_735637
Residue:
1085
  
Inhibitor
Name:
BDBM53958
Synonyms:
CHEMBL1319666 N-[[2-(4-bromanylphenoxy)ethanoylamino]carbamothioyl]ethanamide N-[[[2-(4-bromophenoxy)acetyl]amino]carbamothioyl]acetamide SMR000279447 | cid_1728318
Type:
Small organic molecule
Emp. Form.:
C11H12BrN3O3S
Mol. Mass.:
346.2
SMILES:
CC(=O)NC(=S)NNC(=O)COc1ccc(Br)cc1
: