Target
M1 family aminopeptidase
Ligand
BDBM54017
Substrate
Meas. Tech.
Inhibitors of Plasmodium falciparum M1- Family Alanyl Aminopeptidase (M1AAP)
IC50
2410±n/a nM
Citation
 PubChem, PC Inhibitors of Plasmodium falciparum M1- Family Alanyl Aminopeptidase (M1AAP) PubChem Bioassay (2008)[AID] 
Target
Name:
M1 family aminopeptidase
Synonyms:
AMPN_PLAF7 Zinc aminopeptidase | m1-family aminopeptidase
Type:
PROTEIN
Mol. Mass.:
126072.31
Organism:
Plasmodium falciparum (isolate FcB1 / Columbia)
Description:
ChEMBL_735637
Residue:
1085
  
Inhibitor
Name:
BDBM54017
Synonyms:
5-((4Z)-4-{[5-(4-carboxyphenyl)-2-furyl]methylene}-3-methyl-5-oxo-4,5-dihydro-1H-pyrazol-1-yl)-2-chlorobenzoic acid 5-[(4Z)-4-[[5-(4-carboxyphenyl)-2-furyl]methylene]-5-keto-3-methyl-2-pyrazolin-1-yl]-2-chloro-benzoic acid 5-[(4Z)-4-[[5-(4-carboxyphenyl)furan-2-yl]methylidene]-3-methyl-5-oxopyrazol-1-yl]-2-chlorobenzoic acid SMR000312901 | cid_6185045
Type:
Small organic molecule
Emp. Form.:
C23H15ClN2O6
Mol. Mass.:
450.828
SMILES:
OC(=O)c1ccc(cc1)-c1ccc(C=c2c(=C)[nH]n(-c3ccc(Cl)c(c3)C(O)=O)c2=O)o1
: