Target
M1 family aminopeptidase
Ligand
BDBM50541
Substrate
Meas. Tech.
Inhibitors of Plasmodium falciparum M1- Family Alanyl Aminopeptidase (M1AAP)
IC50
9850±n/a nM
Citation
 PubChem, PC Inhibitors of Plasmodium falciparum M1- Family Alanyl Aminopeptidase (M1AAP) PubChem Bioassay (2008)[AID] 
Target
Name:
M1 family aminopeptidase
Synonyms:
AMPN_PLAF7 Zinc aminopeptidase | m1-family aminopeptidase
Type:
PROTEIN
Mol. Mass.:
126072.31
Organism:
Plasmodium falciparum (isolate FcB1 / Columbia)
Description:
ChEMBL_735637
Residue:
1085
  
Inhibitor
Name:
BDBM50541
Synonyms:
(6Z)-6-[(2,5-dimethyl-1H-indol-3-yl)methylene]-5-imino-3-(isopropylsulfonyl)-5,6-dihydro-7H-[1,2,4]thiadiazolo[4,5-a]pyrimidin-7-one 5-amino-6-[(Z)-(2,5-dimethylindol-3-ylidene)methyl]-3-isopropylsulfonyl-[1,2,4]thiadiazolo[4,5-a]pyrimidin-7-one 5-azanyl-6-[(Z)-(2,5-dimethylindol-3-ylidene)methyl]-3-propan-2-ylsulfonyl-[1,2,4]thiadiazolo[4,5-a]pyrimidin-7-one SMR000309121 | cid_16195591
Type:
Small organic molecule
Emp. Form.:
C19H19N5O3S2
Mol. Mass.:
429.516
SMILES:
CC(C)S(=O)(=O)c1nsc2nc(=O)c(\C=C3/C(C)=Nc4ccc(C)cc34)c(N)n12
: