Target
Nucleotide-binding oligomerization domain-containing protein 2
Ligand
BDBM54156
Substrate
Meas. Tech.
uHTS luminescence assay for the identification of compounds that inhibit NOD2 in MDP treated cells
IC50
2407±n/a nM
Citation
 PubChem, PC uHTS luminescence assay for the identification of compounds that inhibit NOD2 in MDP treated cells PubChem Bioassay (2010)[AID] 
Target
Name:
Nucleotide-binding oligomerization domain-containing protein 2
Synonyms:
CARD15 IBD1 NOD2 Nucleotide-binding oligomerization domain-containing protein 2 | nucleotide-binding oligomerization domain containing 2
Type:
PROTEIN
Mol. Mass.:
115287.18
Organism:
Homo sapiens (Human)
Description:
ChEMBL_1454053
Residue:
1040
  
Inhibitor
Name:
BDBM54156
Synonyms:
Furan-2-carboxylic acid [1-(2-p-tolyloxy-ethyl)-1H-benzoimidazol-2-yl]-amide N-[1-[2-(4-methylphenoxy)ethyl]-2-benzimidazolyl]-2-furancarboxamide N-[1-[2-(4-methylphenoxy)ethyl]benzimidazol-2-yl]furan-2-carboxamide cid_652971
Type:
Small organic molecule
Emp. Form.:
C21H19N3O3
Mol. Mass.:
361.3939
SMILES:
Cc1ccc(OCCn2c(NC(=O)c3ccco3)nc3ccccc23)cc1
: