Target
Nucleotide-binding oligomerization domain-containing protein 2
Ligand
BDBM54189
Substrate
Meas. Tech.
uHTS luminescence assay for the identification of compounds that inhibit NOD2 in MDP treated cells
IC50
1761±n/a nM
Citation
 PubChem, PC uHTS luminescence assay for the identification of compounds that inhibit NOD2 in MDP treated cells PubChem Bioassay (2010)[AID] 
Target
Name:
Nucleotide-binding oligomerization domain-containing protein 2
Synonyms:
CARD15 IBD1 NOD2 Nucleotide-binding oligomerization domain-containing protein 2 | nucleotide-binding oligomerization domain containing 2
Type:
PROTEIN
Mol. Mass.:
115287.18
Organism:
Homo sapiens (Human)
Description:
ChEMBL_1454053
Residue:
1040
  
Inhibitor
Name:
BDBM54189
Synonyms:
1-(3-methoxyphenyl)-3-[(Z)-(2-oxidanylidene-1-prop-2-enyl-indol-3-ylidene)amino]thiourea 1-(3-methoxyphenyl)-3-[(Z)-(2-oxo-1-prop-2-enylindol-3-ylidene)amino]thiourea MLS000522061 cid_6296179
Type:
Small organic molecule
Emp. Form.:
C19H18N4O2S
Mol. Mass.:
366.437
SMILES:
COc1cccc(NC(=S)NN=C2C(=O)N(CC=C)c3ccccc23)c1
: