Target
Nucleotide-binding oligomerization domain-containing protein 2
Ligand
BDBM54195
Substrate
Meas. Tech.
uHTS luminescence assay for the identification of compounds that inhibit NOD2 in MDP treated cells
IC50
480±n/a nM
Citation
 PubChem, PC uHTS luminescence assay for the identification of compounds that inhibit NOD2 in MDP treated cells PubChem Bioassay (2010)[AID] 
Target
Name:
Nucleotide-binding oligomerization domain-containing protein 2
Synonyms:
CARD15 IBD1 NOD2 Nucleotide-binding oligomerization domain-containing protein 2 | nucleotide-binding oligomerization domain containing 2
Type:
PROTEIN
Mol. Mass.:
115287.18
Organism:
Homo sapiens (Human)
Description:
ChEMBL_1454053
Residue:
1040
  
Inhibitor
Name:
BDBM54195
Synonyms:
2-[[2,5-dimethyl-1-(4-methylphenyl)-3-pyrrolyl]methylidene]-1-thiazolo[3,2-a]benzimidazolone 2-[[2,5-dimethyl-1-(p-tolyl)pyrrol-3-yl]methylene]thiazolo[3,2-a]benzimidazol-1-one MLS000533512 cid_1363072
Type:
Small organic molecule
Emp. Form.:
C23H19N3OS
Mol. Mass.:
385.481
SMILES:
Cc1cc(C=c2sc3nc4ccccc4n3c2=O)c(C)n1-c1ccc(C)cc1
: