Target
Nucleotide-binding oligomerization domain-containing protein 2
Ligand
BDBM54218
Substrate
Meas. Tech.
uHTS luminescence assay for the identification of compounds that inhibit NOD2 in MDP treated cells
IC50
1471±n/a nM
Citation
 PubChem, PC uHTS luminescence assay for the identification of compounds that inhibit NOD2 in MDP treated cells PubChem Bioassay (2010)[AID] 
Target
Name:
Nucleotide-binding oligomerization domain-containing protein 2
Synonyms:
CARD15 IBD1 NOD2 Nucleotide-binding oligomerization domain-containing protein 2 | nucleotide-binding oligomerization domain containing 2
Type:
PROTEIN
Mol. Mass.:
115287.18
Organism:
Homo sapiens (Human)
Description:
ChEMBL_1454053
Residue:
1040
  
Inhibitor
Name:
BDBM54218
Synonyms:
(6-bromoquinazolin-4-yl)-(4-chlorophenyl)amine 6-bromo-N-(4-chlorophenyl)-4-quinazolinamine MLS000572334 cid_720639
Type:
Small organic molecule
Emp. Form.:
C14H9BrClN3
Mol. Mass.:
334.598
SMILES:
Clc1ccc(Nc2ncnc3ccc(Br)cc23)cc1
: