Target
Nucleotide-binding oligomerization domain-containing protein 2
Ligand
BDBM54335
Substrate
Meas. Tech.
uHTS luminescence assay for the identification of compounds that inhibit NOD2 in MDP treated cells
IC50
3000±n/a nM
Citation
 PubChem, PC uHTS luminescence assay for the identification of compounds that inhibit NOD2 in MDP treated cells PubChem Bioassay (2010)[AID] 
Target
Name:
Nucleotide-binding oligomerization domain-containing protein 2
Synonyms:
CARD15 IBD1 NOD2 Nucleotide-binding oligomerization domain-containing protein 2 | nucleotide-binding oligomerization domain containing 2
Type:
PROTEIN
Mol. Mass.:
115287.18
Organism:
Homo sapiens (Human)
Description:
ChEMBL_1454053
Residue:
1040
  
Inhibitor
Name:
BDBM54335
Synonyms:
(5E)-5-[(2,5-dimethylphenyl)hydrazinylidene]-8-quinolinone (5E)-5-[(2,5-dimethylphenyl)hydrazono]quinolin-8-one MLS000681763 cid_16194507
Type:
Small organic molecule
Emp. Form.:
C17H15N3O
Mol. Mass.:
277.3205
SMILES:
Cc1ccc(C)c(c1)N=Nc1ccc(O)c2ncccc12
: