Target
Nucleotide-binding oligomerization domain-containing protein 2
Ligand
BDBM54524
Substrate
Meas. Tech.
uHTS luminescence assay for the identification of compounds that inhibit NOD2 in MDP treated cells
IC50
2712±n/a nM
Citation
 PubChem, PC uHTS luminescence assay for the identification of compounds that inhibit NOD2 in MDP treated cells PubChem Bioassay (2010)[AID] 
Target
Name:
Nucleotide-binding oligomerization domain-containing protein 2
Synonyms:
CARD15 IBD1 NOD2 Nucleotide-binding oligomerization domain-containing protein 2 | nucleotide-binding oligomerization domain containing 2
Type:
PROTEIN
Mol. Mass.:
115287.18
Organism:
Homo sapiens (Human)
Description:
ChEMBL_1454053
Residue:
1040
  
Inhibitor
Name:
BDBM54524
Synonyms:
MLS001101361 N-[1-(2-fluorophenyl)-4,5,6,7-tetrahydroindazol-4-yl]-2-methyl-pyrazole-3-carboxamide SMR000653893 | cid_24817447
Type:
Small organic molecule
Emp. Form.:
C18H18FN5O
Mol. Mass.:
339.3668
SMILES:
Cn1nccc1C(=O)NC1CCCc2c1cnn2-c1ccccc1F
: