Target
Cell division control protein 42 homolog
Ligand
BDBM54583
Substrate
Meas. Tech.
Oxadiazole SAR compounds tested by Multiplex dose response to identify specific small molecule inhibitors of Ras and Ras-related GTPases specifically Cdc42 activated mutant
Ki
220±n/a nM
Citation
 PubChem, PC Oxadiazole SAR compounds tested by Multiplex dose response to identify specific small molecule inhibitors of Ras and Ras-related GTPases specifically Cdc42 activated mutant PubChem Bioassay (2009)[AID] 
Target
Name:
Cell division control protein 42 homolog
Synonyms:
CDC42 Cell division control protein 42 homolog cell division cycle 42 (GTP binding protein, 25kDa)
Type:
PROTEIN
Mol. Mass.:
21258.36
Organism:
Homo sapiens (Human)
Description:
ChEMBL_652970
Residue:
191
  
Inhibitor
Name:
BDBM54583
Synonyms:
1-[4-(2,5-dimethylphenyl)-1-piperazinyl]-3-[3-(4-methoxyphenyl)-5-isoxazolyl]-1-propanone 1-[4-(2,5-dimethylphenyl)piperazino]-3-[3-(4-methoxyphenyl)isoxazol-5-yl]propan-1-one UNM-0000306149 | cid_44143705
Type:
Small organic molecule
Emp. Form.:
C25H29N3O3
Mol. Mass.:
419.5161
SMILES:
COc1ccc(cc1)-c1cc(CCC(=O)N2CCN(CC2)c2cc(C)ccc2C)on1
: