Target
SUMO-conjugating enzyme UBC9
Ligand
BDBM54915
Substrate
Meas. Tech.
AlphaScreen confirmatory assay for validation of inhibitors of SUMOylation
IC50
680±n/a nM
Citation
 PubChem, PC AlphaScreen confirmatory assay for validation of inhibitors of SUMOylation PubChem Bioassay (2010)[AID] 
Target
Name:
SUMO-conjugating enzyme UBC9
Synonyms:
UBC9 UBCE9 ubiquitin-conjugating enzyme E2I
Type:
Enzyme Catalytic Domain
Mol. Mass.:
18011.66
Organism:
Homo sapiens (Human)
Description:
gi_4507785
Residue:
158
  
Inhibitor
Name:
BDBM54915
Synonyms:
MLS000588658 N-[1-Butyl-3-(toluene-4-sulfonyl)-1H-pyrrolo[2,3-b]quinoxalin-2-yl]-benzenesulfonamide N-[1-butyl-3-(4-methylphenyl)sulfonyl-pyrrolo[3,2-b]quinoxalin-2-yl]benzenesulfonamide SMR000212297 cid_1930124
Type:
Small organic molecule
Emp. Form.:
C27H26N4O4S2
Mol. Mass.:
534.65
SMILES:
CCCCn1c(NS(=O)(=O)c2ccccc2)c(c2nc3ccccc3nc12)S(=O)(=O)c1ccc(C)cc1
: