Target
SUMO-conjugating enzyme UBC9
Ligand
BDBM52817
Substrate
Meas. Tech.
AlphaScreen confirmatory assay for validation of inhibitors of SUMOylation
IC50
1120±n/a nM
Citation
 PubChem, PC AlphaScreen confirmatory assay for validation of inhibitors of SUMOylation PubChem Bioassay (2010)[AID] 
Target
Name:
SUMO-conjugating enzyme UBC9
Synonyms:
UBC9 UBCE9 ubiquitin-conjugating enzyme E2I
Type:
Enzyme Catalytic Domain
Mol. Mass.:
18011.66
Organism:
Homo sapiens (Human)
Description:
gi_4507785
Residue:
158
  
Inhibitor
Name:
BDBM52817
Synonyms:
2-[(5Z)-5-[(E)-3-(2-furanyl)prop-2-enylidene]-4-oxo-2-sulfanylidene-3-thiazolidinyl]butanedioic acid 2-[(5Z)-5-[(E)-3-(furan-2-yl)prop-2-enylidene]-4-oxidanylidene-2-sulfanylidene-1,3-thiazolidin-3-yl]butanedioic acid 2-{5-[(E)-3-Furan-2-yl-prop-2-en-(Z)-ylidene]-4-oxo-2-thioxo-thiazolidin-3-yl}-succinic acid SMR000415428 | cid_5994065
Type:
Small organic molecule
Emp. Form.:
C14H11NO6S2
Mol. Mass.:
353.37
SMILES:
OC(=O)CC(N1C(=S)S\C(=C/C=C/c2ccco2)C1=O)C(O)=O
: