Target
Cell division control protein 42 homolog
Ligand
BDBM54628
Substrate
Meas. Tech.
Pyrazoline SAR compounds tested via Multiplex dose response to identify specific small molecule inhibitors of Ras and Ras-related GTPases specifically Cdc42 wildtype protein
EC50
30000±n/a nM
Citation
 PubChem, PC Pyrazoline SAR compounds tested via Multiplex dose response to identify specific small molecule inhibitors of Ras and Ras-related GTPases specifically Cdc42 wildtype protein PubChem Bioassay (2009)[AID] 
Target
Name:
Cell division control protein 42 homolog
Synonyms:
CDC42 Cell division control protein 42 homolog cell division cycle 42 (GTP binding protein, 25kDa)
Type:
PROTEIN
Mol. Mass.:
21258.36
Organism:
Homo sapiens (Human)
Description:
ChEMBL_652970
Residue:
191
  
Inhibitor
Name:
BDBM54628
Synonyms:
3-(4-fluorophenyl)-5-(3-nitrophenyl)-1-phenyl-2-pyrazoline UNM-0000305867 | cid_2933589
Type:
Small organic molecule
Emp. Form.:
C21H16FN3O2
Mol. Mass.:
361.369
SMILES:
[O-][N+](=O)c1cccc(c1)C1C[C-](N=[N+]1c1ccccc1)c1ccc(F)cc1
: