Target
Cell division control protein 42 homolog
Ligand
BDBM54640
Substrate
Meas. Tech.
Pyrazoline SAR compounds tested via Multiplex dose response to identify specific small molecule inhibitors of Ras and Ras-related GTPases specifically Cdc42 wildtype protein
EC50
2296±n/a nM
Citation
 PubChem, PC Pyrazoline SAR compounds tested via Multiplex dose response to identify specific small molecule inhibitors of Ras and Ras-related GTPases specifically Cdc42 wildtype protein PubChem Bioassay (2009)[AID] 
Target
Name:
Cell division control protein 42 homolog
Synonyms:
CDC42 Cell division control protein 42 homolog cell division cycle 42 (GTP binding protein, 25kDa)
Type:
PROTEIN
Mol. Mass.:
21258.36
Organism:
Homo sapiens (Human)
Description:
ChEMBL_652970
Residue:
191
  
Inhibitor
Name:
BDBM54640
Synonyms:
4-[3-(4-Chloro-phenyl)-5-(4-methoxy-phenyl)-4,5-dihydropyrazol-1-yl]-benzene-sulfonamide (10f) 4-[5-(4-chlorophenyl)-3-(4-methoxyphenyl)-3,4-dihydropyrazol-2-yl]benzenesulfonamide UNM-0000306132 | cid_42628051
Type:
Small organic molecule
Emp. Form.:
C22H20ClN3O3S
Mol. Mass.:
441.931
SMILES:
COc1ccc(cc1)C1CC(=NN1c1ccc(cc1)S(N)(=O)=O)c1ccc(Cl)cc1
: