Target
Cell division control protein 42 homolog
Ligand
BDBM54667
Substrate
Meas. Tech.
Pyrazoline SAR compounds tested via Multiplex dose response to identify specific small molecule inhibitors of Ras and Ras-related GTPases specifically Cdc42 wildtype protein
EC50
30000±n/a nM
Citation
 PubChem, PC Pyrazoline SAR compounds tested via Multiplex dose response to identify specific small molecule inhibitors of Ras and Ras-related GTPases specifically Cdc42 wildtype protein PubChem Bioassay (2009)[AID] 
Target
Name:
Cell division control protein 42 homolog
Synonyms:
CDC42 Cell division control protein 42 homolog cell division cycle 42 (GTP binding protein, 25kDa)
Type:
PROTEIN
Mol. Mass.:
21258.36
Organism:
Homo sapiens (Human)
Description:
ChEMBL_652970
Residue:
191
  
Inhibitor
Name:
BDBM54667
Synonyms:
4-[3-(4-methoxyphenyl)-5-[2-(trifluoromethyl)phenyl]-3,4-dihydropyrazol-2-yl]benzenesulfonamide KUC103474N | cid_44216837
Type:
Small organic molecule
Emp. Form.:
C23H20F3N3O3S
Mol. Mass.:
475.483
SMILES:
COc1ccc(cc1)C1CC(=NN1c1ccc(cc1)S(N)(=O)=O)c1ccccc1C(F)(F)F
: