Target
Cell division control protein 42 homolog
Ligand
BDBM54586
Substrate
Meas. Tech.
Pyrazoline SAR compounds tested via Multiplex dose response to identify specific small molecule inhibitors of Ras and Ras-related GTPases specifically Cdc42 activated mutant
Ki
940±n/a nM
Citation
 PubChem, PC Pyrazoline SAR compounds tested via Multiplex dose response to identify specific small molecule inhibitors of Ras and Ras-related GTPases specifically Cdc42 activated mutant PubChem Bioassay (2009)[AID] 
Target
Name:
Cell division control protein 42 homolog
Synonyms:
CDC42 Cell division control protein 42 homolog cell division cycle 42 (GTP binding protein, 25kDa)
Type:
PROTEIN
Mol. Mass.:
21258.36
Organism:
Homo sapiens (Human)
Description:
ChEMBL_652970
Residue:
191
  
Inhibitor
Name:
BDBM54586
Synonyms:
4-[3-(3,4-dimethoxyphenyl)-5-phenyl-3,4-dihydropyrazol-2-yl]benzenesulfonamide UNM-0000305823 | cid_2971684
Type:
Small organic molecule
Emp. Form.:
C23H23N3O4S
Mol. Mass.:
437.511
SMILES:
COc1ccc(cc1OC)C1CC(=NN1c1ccc(cc1)S(N)(=O)=O)c1ccccc1
: