Target
Cell division control protein 42 homolog
Ligand
BDBM54660
Substrate
Meas. Tech.
Pyrazoline SAR compounds tested via Multiplex dose response to identify specific small molecule inhibitors of Ras and Ras-related GTPases specifically Cdc42 activated mutant
Ki
1140±n/a nM
Citation
 PubChem, PC Pyrazoline SAR compounds tested via Multiplex dose response to identify specific small molecule inhibitors of Ras and Ras-related GTPases specifically Cdc42 activated mutant PubChem Bioassay (2009)[AID] 
Target
Name:
Cell division control protein 42 homolog
Synonyms:
CDC42 Cell division control protein 42 homolog cell division cycle 42 (GTP binding protein, 25kDa)
Type:
PROTEIN
Mol. Mass.:
21258.36
Organism:
Homo sapiens (Human)
Description:
ChEMBL_652970
Residue:
191
  
Inhibitor
Name:
BDBM54660
Synonyms:
4-[3-(4-methoxyphenyl)-5-(3-thiophenyl)-3,4-dihydropyrazol-2-yl]benzenesulfonamide 4-[5-(4-methoxyphenyl)-3-(3-thienyl)-2-pyrazolin-1-yl]benzenesulfonamide UNM-0000306158 | cid_44143713
Type:
Small organic molecule
Emp. Form.:
C20H19N3O3S2
Mol. Mass.:
413.513
SMILES:
COc1ccc(cc1)C1CC(=NN1c1ccc(cc1)S(N)(=O)=O)c1ccsc1
: