Target
Cell division control protein 42 homolog
Ligand
BDBM54672
Substrate
Meas. Tech.
Pyrazoline SAR compounds tested via Multiplex dose response to identify specific small molecule inhibitors of Ras and Ras-related GTPases specifically Cdc42 activated mutant
Ki
1620±n/a nM
Citation
 PubChem, PC Pyrazoline SAR compounds tested via Multiplex dose response to identify specific small molecule inhibitors of Ras and Ras-related GTPases specifically Cdc42 activated mutant PubChem Bioassay (2009)[AID] 
Target
Name:
Cell division control protein 42 homolog
Synonyms:
CDC42 Cell division control protein 42 homolog cell division cycle 42 (GTP binding protein, 25kDa)
Type:
PROTEIN
Mol. Mass.:
21258.36
Organism:
Homo sapiens (Human)
Description:
ChEMBL_652970
Residue:
191
  
Inhibitor
Name:
BDBM54672
Synonyms:
4-[3-(4-bromophenyl)-5-(3-methoxyphenyl)-3,4-dihydropyrazol-2-yl]benzenesulfonamide KUC103479N | cid_44216842
Type:
Small organic molecule
Emp. Form.:
C22H20BrN3O3S
Mol. Mass.:
486.382
SMILES:
COc1cccc(c1)C1=NN(C(C1)c1ccc(Br)cc1)c1ccc(cc1)S(N)(=O)=O
: