Target
Cell division control protein 42 homolog
Ligand
BDBM7392
Substrate
Meas. Tech.
Additional SAR compounds tested by Multiplex dose response to identify specific small molecule inhibitors of Ras and Ras-related GTPases specifically Cdc42 activated mutant
EC50
30000±n/a nM
Citation
 PubChem, PC Additional SAR compounds tested by Multiplex dose response to identify specific small molecule inhibitors of Ras and Ras-related GTPases specifically Cdc42 activated mutant PubChem Bioassay (2009)[AID] 
Target
Name:
Cell division control protein 42 homolog
Synonyms:
CDC42 Cell division control protein 42 homolog cell division cycle 42 (GTP binding protein, 25kDa)
Type:
PROTEIN
Mol. Mass.:
21258.36
Organism:
Homo sapiens (Human)
Description:
ChEMBL_652970
Residue:
191
  
Inhibitor
Name:
BDBM7392
Synonyms:
2-[(3Z)-2-oxo-2,3-dihydro-1H-indol-3-ylidene]-2,3-dihydro-1H-indol-3-one Indirubin derivative, 1 | cid_5318433
Type:
Small organic molecule
Emp. Form.:
C16H10N2O2
Mol. Mass.:
262.2628
SMILES:
O=C1Nc2ccccc2\C1=C1\Nc2ccccc2C1=O
: