Target
Cell division control protein 42 homolog
Ligand
BDBM54693
Substrate
Meas. Tech.
Additional SAR compounds tested by Multiplex dose response to identify specific small molecule inhibitors of Ras and Ras-related GTPases specifically Cdc42 activated mutant
Ki
400±n/a nM
Citation
 PubChem, PC Additional SAR compounds tested by Multiplex dose response to identify specific small molecule inhibitors of Ras and Ras-related GTPases specifically Cdc42 activated mutant PubChem Bioassay (2009)[AID] 
Target
Name:
Cell division control protein 42 homolog
Synonyms:
CDC42 Cell division control protein 42 homolog cell division cycle 42 (GTP binding protein, 25kDa)
Type:
PROTEIN
Mol. Mass.:
21258.36
Organism:
Homo sapiens (Human)
Description:
ChEMBL_652970
Residue:
191
  
Inhibitor
Name:
BDBM54693
Synonyms:
UNM-0000305812 sodium;(2R)-2-(6-methoxy-2-naphthalenyl)propanoate sodium;(2R)-2-(6-methoxynaphthalen-2-yl)propanoate
Type:
Small organic molecule
Emp. Form.:
C14H13O3
Mol. Mass.:
229.2518
SMILES:
COc1ccc2cc(ccc2c1)[C@@H](C)C([O-])=O
: