Target
Cell division control protein 42 homolog
Ligand
BDBM54676
Substrate
Meas. Tech.
Additional SAR compounds tested via Multiplex dose response to identify specific small molecule inhibitors of Ras and Ras-related GTPases specifically Cdc42 wildtype
EC50
30000±n/a nM
Citation
 PubChem, PC Additional SAR compounds tested via Multiplex dose response to identify specific small molecule inhibitors of Ras and Ras-related GTPases specifically Cdc42 wildtype PubChem Bioassay (2009)[AID] 
Target
Name:
Cell division control protein 42 homolog
Synonyms:
CDC42 Cell division control protein 42 homolog cell division cycle 42 (GTP binding protein, 25kDa)
Type:
PROTEIN
Mol. Mass.:
21258.36
Organism:
Homo sapiens (Human)
Description:
ChEMBL_652970
Residue:
191
  
Inhibitor
Name:
BDBM54676
Synonyms:
(3Z)-3-(5-keto-2-thioxo-imidazolidin-4-ylidene)oxindole (3Z)-3-(5-oxo-2-sulfanylidene-4-imidazolidinylidene)-1H-indol-2-one UNM-0000305762 | cid_5339891
Type:
Small organic molecule
Emp. Form.:
C11H7N3O2S
Mol. Mass.:
245.257
SMILES:
O=C1NC(=S)N\C1=C1/C(=O)Nc2ccccc12
: