Target
Cell division control protein 42 homolog
Ligand
BDBM54680
Substrate
Meas. Tech.
Additional SAR compounds tested via Multiplex dose response to identify specific small molecule inhibitors of Ras and Ras-related GTPases specifically Cdc42 wildtype
EC50
30000±n/a nM
Citation
 PubChem, PC Additional SAR compounds tested via Multiplex dose response to identify specific small molecule inhibitors of Ras and Ras-related GTPases specifically Cdc42 wildtype PubChem Bioassay (2009)[AID] 
Target
Name:
Cell division control protein 42 homolog
Synonyms:
CDC42 Cell division control protein 42 homolog cell division cycle 42 (GTP binding protein, 25kDa)
Type:
PROTEIN
Mol. Mass.:
21258.36
Organism:
Homo sapiens (Human)
Description:
ChEMBL_652970
Residue:
191
  
Inhibitor
Name:
BDBM54680
Synonyms:
(3Z)-5-bromanyl-3-(3-oxidanylidene-1H-indol-2-ylidene)-1H-indol-2-one (3Z)-5-bromo-3-(3-oxo-1H-indol-2-ylidene)-1H-indol-2-one cid_5287845
Type:
Small organic molecule
Emp. Form.:
C16H9BrN2O2
Mol. Mass.:
341.159
SMILES:
Brc1ccc2NC(=O)C(=C3Nc4ccccc4C3=O)c2c1
: