Target
Cell division control protein 42 homolog
Ligand
BDBM54682
Substrate
Meas. Tech.
Additional SAR compounds tested via Multiplex dose response to identify specific small molecule inhibitors of Ras and Ras-related GTPases specifically Cdc42 wildtype
EC50
30000±n/a nM
Citation
 PubChem, PC Additional SAR compounds tested via Multiplex dose response to identify specific small molecule inhibitors of Ras and Ras-related GTPases specifically Cdc42 wildtype PubChem Bioassay (2009)[AID] 
Target
Name:
Cell division control protein 42 homolog
Synonyms:
CDC42 Cell division control protein 42 homolog cell division cycle 42 (GTP binding protein, 25kDa)
Type:
PROTEIN
Mol. Mass.:
21258.36
Organism:
Homo sapiens (Human)
Description:
ChEMBL_652970
Residue:
191
  
Inhibitor
Name:
BDBM54682
Synonyms:
5-bromanyl-3-[3-(oxidanylamino)-1H-indol-2-yl]indol-2-one 5-bromo-3-[3-(hydroxyamino)-1H-indol-2-yl]indol-2-one cid_24205929
Type:
Small organic molecule
Emp. Form.:
C16H10BrN3O2
Mol. Mass.:
356.174
SMILES:
ONc1c([nH]c2ccccc12)C1=c2cc(Br)ccc2=NC1=O
: