Target
Cell division control protein 42 homolog
Ligand
BDBM54684
Substrate
Meas. Tech.
Additional SAR compounds tested via Multiplex dose response to identify specific small molecule inhibitors of Ras and Ras-related GTPases specifically Cdc42 wildtype
EC50
30000±n/a nM
Citation
 PubChem, PC Additional SAR compounds tested via Multiplex dose response to identify specific small molecule inhibitors of Ras and Ras-related GTPases specifically Cdc42 wildtype PubChem Bioassay (2009)[AID] 
Target
Name:
Cell division control protein 42 homolog
Synonyms:
CDC42 Cell division control protein 42 homolog cell division cycle 42 (GTP binding protein, 25kDa)
Type:
PROTEIN
Mol. Mass.:
21258.36
Organism:
Homo sapiens (Human)
Description:
ChEMBL_652970
Residue:
191
  
Inhibitor
Name:
BDBM54684
Synonyms:
7-chloranyl-3-[3-(oxidanylamino)-1H-indol-2-yl]indol-2-one 7-chloro-3-[3-(hydroxyamino)-1H-indol-2-yl]indol-2-one cid_11845976
Type:
Small organic molecule
Emp. Form.:
C16H10ClN3O2
Mol. Mass.:
311.723
SMILES:
ONc1c([nH]c2ccccc12)C1=c2cccc(Cl)c2=NC1=O
: