Target
Cell division control protein 42 homolog
Ligand
BDBM54691
Substrate
Meas. Tech.
Additional SAR compounds tested via Multiplex dose response to identify specific small molecule inhibitors of Ras and Ras-related GTPases specifically Cdc42 wildtype
EC50
30000±n/a nM
Citation
 PubChem, PC Additional SAR compounds tested via Multiplex dose response to identify specific small molecule inhibitors of Ras and Ras-related GTPases specifically Cdc42 wildtype PubChem Bioassay (2009)[AID] 
Target
Name:
Cell division control protein 42 homolog
Synonyms:
CDC42 Cell division control protein 42 homolog cell division cycle 42 (GTP binding protein, 25kDa)
Type:
PROTEIN
Mol. Mass.:
21258.36
Organism:
Homo sapiens (Human)
Description:
ChEMBL_652970
Residue:
191
  
Inhibitor
Name:
BDBM54691
Synonyms:
2-amino-5-benzoyl-1-(2,4,6-triisopropylphenyl)sulfonyl-4-(3,4,5-trimethoxyphenyl)pyrrole-3-carbonitrile 2-amino-5-benzoyl-4-(3,4,5-trimethoxyphenyl)-1-[2,4,6-tri(propan-2-yl)phenyl]sulfonylpyrrole-3-carbonitrile UNM-0000305781 | cid_25220932
Type:
Small organic molecule
Emp. Form.:
C36H41N3O6S
Mol. Mass.:
643.792
SMILES:
COc1cc(cc(OC)c1OC)-c1c(C#N)c(N)n(c1C(=O)c1ccccc1)S(=O)(=O)c1c(cc(cc1C(C)C)C(C)C)C(C)C
: